Reaction Details
TargetProtein kinase C gamma type
LigandBDBM50280454
Substrate/Competitorn/a
Meas. Tech.ChEMBL_161279 (CHEMBL878782)
Ki 1030±n/a nM
Citation Irie, KYanai, YOhigashi, HWender, PAMiller, BL Synthesis and characterization of the second cysteine-rich region of mouse skin PKCGh Bioorg Med Chem Lett6:353-356 (1996)    Article
 
Protein kinase C gamma type
Name:Protein kinase C gamma type
Type:PROTEIN
Mol. Mass.:78367.88
Organism:Rattus norvegicus
Description:ChEMBL_152979
Residue:697
BDBM50280454
NameBDBM50280454
Synonyms:(10S,13S)-13-Hydroxymethyl-10-isopropyl-9-methyl-3,9,12-triaza-tricyclo[6.6.1.0*4,15*]pentadeca-4,6,8(15)-trien-11-one | CHEMBL120645
TypeSmall organic molecule
Emp. Form.C17H25N3O2
Mol. Mass.303.3993
SMILESCC(C)[C@@H]1N(C)c2cccc3NCC(C[C@@H](CO)NC1=O)c23