Reaction Details
TargetProtein kinase C gamma type
LigandBDBM50064089
Substrate/Competitorn/a
Meas. Tech.ChEBML_161279
Ki 2±n/a nM
Citation Irie, KYanai, YOhigashi, HWender, PAMiller, BL Synthesis and characterization of the second cysteine-rich region of mouse skin PKCGh Bioorg Med Chem Lett6:353-356 (1996)    Article
 
Protein kinase C gamma type
Name:Protein kinase C gamma type
Type:PROTEIN
Mol. Mass.:78367.88
Organism:Rattus norvegicus
Description:ChEMBL_152979
Residue:697
BDBM50064089
NameBDBM50064089
Synonyms:4-hydroxymethyl-7,10-diisopropyl-8,10,13-trimethyl-13-vinyl-(4S,7S,10R,13R)-3,4,5,6,7,8,10,11,12,13-decahydro-1H-benzo[g][1,4]diazonino[7,6,5-cd]indol-6-one teleocidin B-4 | telocidinB-4 4-hydroxymethyl-7,10-diisopropyl-8,10,13-trimethyl-13-vinyl-(4S,7S,10R,13R)-3,4,5,6,7,8,10,11,12,13-decahydro-1H-benzo[g][1,4]diazonino[7,6,5-cd]indol-6-one
TypeSmall organic molecule
Emp. Form.C28H41N3O2
Mol. Mass.451.644
SMILESCC(C)[C@@H]1N(C)c2cc3c(c4[nH]cc(C[C@@H](CO)NC1=O)c24)[C@](C)(CC[C@]3(C)C(C)C)C=C