Reaction Details
TargetCarbonic anhydrase 2
LigandBDBM50101343
Substrate/Competitorn/a
Meas. Tech.ChEMBL_45055 (CHEMBL658053)
Kd 310±n/a nM
Citation Sigal, GBWhitesides, GM Benzenesulfonamide-peptide conjugates as probes for secondary binding sites near the active site of carbonic anhydrase Bioorg Med Chem Lett6:559-564 (1996)    Article
 
Carbonic anhydrase 2
Name:Carbonic anhydrase 2
Type:Enzyme
Mol. Mass.:29250.71
Organism:Homo sapiens (Human)
Description:P00918
Residue:260
BDBM50101343
NameBDBM50101343
Synonyms:(4-Sulfamoyl-benzoylamino)-acetic acid | CHEMBL51385
TypeSmall organic molecule
Emp. Form.C9H10N2O5S
Mol. Mass.258.251
SMILESNS(=O)(=O)c1ccc(cc1)C(=O)NCC(O)=O