Reaction Details
TargetCarbonic anhydrase 2
LigandBDBM50288858
Substrate/Competitorn/a
Meas. Tech.ChEBML_45054
Kd 230±n/a nM
Citation Sigal, GBWhitesides, GM Benzenesulfonamide-peptide conjugates as probes for secondary binding sites near the active site of carbonic anhydrase Bioorg Med Chem Lett6:559-564 (1996)    Article
 
Carbonic anhydrase 2
Name:Carbonic anhydrase 2
Type:Enzyme
Mol. Mass.:29250.71
Organism:Homo sapiens (Human)
Description:P00918
Residue:260
BDBM50288858
NameBDBM50288858
Synonyms:3-Methyl-2-{2-[2-(4-sulfamoyl-benzoylamino)-acetylamino]-acetylamino}-pentanoic acid | CHEMBL2371093
TypeSmall organic molecule
Emp. Form.C17H24N4O7S
Mol. Mass.428.46
SMILESCC[C@H](C)[C@H](NC(=O)CNC(=O)CNC(=O)c1ccc(cc1)S(N)(=O)=O)C(O)=O