Reaction Details
TargetCarbonic anhydrase 2
LigandBDBM50101373
Substrate/Competitorn/a
Meas. Tech.ChEBML_45054
Kd 530±n/a nM
Citation Sigal, GBWhitesides, GM Benzenesulfonamide-peptide conjugates as probes for secondary binding sites near the active site of carbonic anhydrase Bioorg Med Chem Lett6:559-564 (1996)    Article
 
Carbonic anhydrase 2
Name:Carbonic anhydrase 2
Type:Enzyme
Mol. Mass.:29250.71
Organism:Homo sapiens (Human)
Description:P00918
Residue:260
BDBM50101373
NameBDBM50101373
Synonyms:(S)-2-(4-Sulfamoyl-benzoylamino)-pentanedioic acid | CHEMBL50897
TypeSmall organic molecule
Emp. Form.C12H14N2O7S
Mol. Mass.330.314
SMILESNS(=O)(=O)c1ccc(cc1)C(=O)N[C@@H](CCC(O)=O)C(O)=O