Reaction Details
TargetCarbonic anhydrase 2
LigandBDBM50288884
Substrate/Competitorn/a
Meas. Tech.ChEBML_45054
Kd 160±n/a nM
Citation Sigal, GBWhitesides, GM Benzenesulfonamide-peptide conjugates as probes for secondary binding sites near the active site of carbonic anhydrase Bioorg Med Chem Lett6:559-564 (1996)    Article
 
Carbonic anhydrase 2
Name:Carbonic anhydrase 2
Type:Enzyme
Mol. Mass.:29250.71
Organism:Homo sapiens (Human)
Description:P00918
Residue:260
BDBM50288884
NameBDBM50288884
Synonyms:3-(4-Nitro-phenyl)-2-(2-{2-[2-(4-sulfamoyl-benzoylamino)-acetylamino]-acetylamino}-acetylamino)-propionic acid | CHEMBL2371069
TypeSmall organic molecule
Emp. Form.C22H24N6O10S
Mol. Mass.564.525
SMILESNS(=O)(=O)c1ccc(cc1)C(=O)NCC(=O)NCC(=O)NCC(=O)N[C@@H](Cc1ccc(cc1)[N+]([O-])=O)C(O)=O