Reaction Details
TargetCarbonic anhydrase 2
LigandBDBM50288895
Substrate/Competitorn/a
Meas. Tech.ChEBML_45054
Kd 220±n/a nM
Citation Sigal, GBWhitesides, GM Benzenesulfonamide-peptide conjugates as probes for secondary binding sites near the active site of carbonic anhydrase Bioorg Med Chem Lett6:559-564 (1996)    Article
 
Carbonic anhydrase 2
Name:Carbonic anhydrase 2
Type:Enzyme
Mol. Mass.:29250.71
Organism:Homo sapiens (Human)
Description:P00918
Residue:260
BDBM50288895
NameBDBM50288895
Synonyms:4-Methylsulfanyl-2-{2-[2-(4-sulfamoyl-benzoylamino)-acetylamino]-acetylamino}-butyric acid | CHEMBL2371071
TypeSmall organic molecule
Emp. Form.C18H25N5O8S2
Mol. Mass.503.55
SMILESCSCC[C@@H](NC(=O)CNC(=O)CNC(=O)CNC(=O)c1ccc(cc1)S(N)(=O)=O)C(O)=O