Reaction Details
TargetCarbonic anhydrase 2
LigandBDBM50288900
Substrate/Competitorn/a
Meas. Tech.ChEMBL_45054 (CHEMBL658052)
Kd 360±n/a nM
Citation Sigal, GBWhitesides, GM Benzenesulfonamide-peptide conjugates as probes for secondary binding sites near the active site of carbonic anhydrase Bioorg Med Chem Lett6:559-564 (1996)    Article
 
Carbonic anhydrase 2
Name:Carbonic anhydrase 2
Type:Enzyme
Mol. Mass.:29250.71
Organism:Homo sapiens (Human)
Description:P00918
Residue:260
BDBM50288900
NameBDBM50288900
Synonyms:(2-{2-[2-(4-Sulfamoyl-benzoylamino)-acetylamino]-acetylamino}-acetylamino)-acetic acid | CHEMBL152569
TypeSmall organic molecule
Emp. Form.C15H19N5O8S
Mol. Mass.429.405
SMILESNS(=O)(=O)c1ccc(cc1)C(=O)NCC(=O)NCC(=O)NCC(=O)NCC(O)=O