Reaction Details
TargetProstaglandin G/H synthase 2
LigandBDBM50289087
Substrate/Competitorn/a
Meas. Tech.ChEBML_157856
IC50 2±n/a nM
Citation Black, WCBayly, CBelley, MChan, CCCharleson, SDenis, DGauthier, JYGordon, RGuay, DKargman, SLau, CKLeblanc, YMancini, JOuellet, MPercival, DRoy, PSkorey, KTagari, PVickers, PWong, E From indomethacin to a selective COX-2 inhibitor: Development of indolalkanoic acids as potent and selective cyclooxygenase-2 inhibitors Bioorg Med Chem Lett6:725-730 (1996)    Article
 
Prostaglandin G/H synthase 2
Name:Prostaglandin G/H synthase 2
Type:Enzyme Catalytic Domain
Mol. Mass.:69173.51
Organism:RAT
Description:COX-2 0 RAT::P35355
Residue:604
BDBM50289087
NameBDBM50289087
Synonyms:4-[1-(4-Bromo-benzyl)-5-methoxy-2-methyl-1H-indol-3-yl]-3-methyl-butyric acid L-761000
TypeSmall organic molecule
Emp. Form.C22H24BrNO3
Mol. Mass.430.335
SMILESCOc1ccc2n(Cc3ccc(Br)cc3)c(C)c(CC(C)CC(O)=O)c2c1