Reaction Details
TargetTryptophan 2,3-dioxygenase
LigandBDBM50289138
Substrate/Competitorn/a
Meas. Tech.ChEBML_210838
Ki 40±n/a nM
Citation Madge, DJHazelwood, RIyer, RJones, HTSalter, M Novel tryptophan dioxygenase inhibitors and combined tryptophan dioxygenase/5-HT reuptake inhibitors Bioorg Med Chem Lett6:857-860 (1996)    Article
 
Tryptophan 2,3-dioxygenase
Name:Tryptophan 2,3-dioxygenase
Type:PROTEIN
Mol. Mass.:47856.01
Organism:Rattus norvegicus
Description:ChEMBL_210838
Residue:406
BDBM50289138
NameBDBM50289138
Synonyms:3-((E)-2-Pyridin-3-yl-vinyl)-1H-indole | CHEMBL441669
TypeSmall organic molecule
Emp. Form.C15H12N2
Mol. Mass.220.2692
SMILESC(=C/c1cccnc1)\c1c[nH]c2ccccc12