Reaction Details
TargetSubstance-P receptor
LigandBDBM50000040
Substrate/Competitorn/a
Meas. Tech.ChEBML_142884
IC50 0.330000±n/a nM
Citation Burkholder, TPKudlacz, EMLe, TBKnippenberg, RWShatzer, SAMaynard, GDWebster, MEHorgan, SW Identification and chemical synthesis of MDL 105,212, a non-peptide tachykinin antagonist with high affinity for NK1 and NK2 receptors Bioorg Med Chem Lett6:951-956 (1996)    Article
 
Substance-P receptor
Name:Substance-P receptor
Type:G Protein-Coupled Receptor (GPCR)
Mol. Mass.:46254.43
Organism:Homo sapiens (Human)
Description:P25103
Residue:407
BDBM50000040
NameBDBM50000040
Synonyms:((2S,3S)-2-Benzhydryl-1-aza-bicyclo[2.2.2]oct-3-yl)-(2-methoxy-benzyl)-amine (+)(2-Benzhydryl-1-aza-bicyclo[2.2.2]oct-3-yl)-(2-methoxy-benzyl)-amine (2-Benzhydryl-1-aza-bicyclo[2.2.2]oct-3-yl)-(2-methoxy-benzyl)-amine CP-96,345 i(2-Benzhydryl-1-aza-bicyclo[2.2.2]oct-3-yl)-(2-methoxy-benzyl)-amine
TypeSmall organic molecule
Emp. Form.C28H32N2O
Mol. Mass.412.5665
SMILESCOc1ccccc1CN[C@H]1C2CCN(CC2)[C@H]1C(c1ccccc1)c1ccccc1