Reaction Details
TargetProtein kinase C alpha type
LigandBDBM50289211
Substrate/Competitorn/a
Meas. Tech.ChEBML_152985
IC50 70±n/a nM
Citation Hu, HHollinshead, SPHall, SEKalter, KBallas, LM Synthesis and protein kinase C inhibitory activities of indane analogs of balanol Bioorg Med Chem Lett6:973-978 (1996)    Article
 
Protein kinase C alpha type
Name:Protein kinase C alpha type
Type:Enzyme
Mol. Mass.:76755.65
Organism:Homo sapiens (Human)
Description:The recombinant human PKC enzymes were produced using a baculovirus expression system in SF9 cells
Residue:672
BDBM50289211
NameBDBM50289211
Synonyms:4-(2-Carboxy-6-hydroxy-benzoyl)-3,5-dihydroxy-benzoic acid (R)-2-(4-hydroxy-benzoylamino)-indan-1-yl ester | CHEMBL367162
TypeSmall organic molecule
Emp. Form.C31H23NO10
Mol. Mass.569.515
SMILESOC(=O)c1cccc(O)c1C(=O)c1c(O)cc(cc1O)C(=O)OC1[C@@H](Cc2ccccc12)NC(=O)c1ccc(O)cc1