Reaction Details
TargetProtein kinase C beta type
LigandBDBM3149
Substrate/Competitorn/a
Meas. Tech.ChEMBL_160610 (CHEMBL764581)
IC50 260±n/a nM
Citation Hu, HHollinshead, SPHall, SEKalter, KBallas, LM Synthesis and protein kinase C inhibitory activities of indane analogs of balanol Bioorg Med Chem Lett6:973-978 (1996)    Article
 
Protein kinase C beta type
Name:Protein kinase C beta type
Type:Enzyme
Mol. Mass.:76873.67
Organism:Homo sapiens (Human)
Description:The recombinant human PKC enzymes were produced using a baculovirus expression system in SF9 cells
Residue:671
BDBM3149
NameBDBM3149
Synonyms:2-{[2,6-dihydroxy-4-({[(3R,4R)-3-[(4-hydroxybenzene)amido]azepan-4-yl]oxy}carbonyl)phenyl]carbonyl}-3-hydroxybenzoic acid Balanol analog 1 CHEMBL60254
TypeSmall organic molecule
Emp. Form.C28H26N2O10
Mol. Mass.550.5134
SMILESOC(=O)c1cccc(O)c1C(=O)c1c(O)cc(cc1O)C(=O)O[C@@H]1CCCNC[C@H]1NC(=O)c1ccc(O)cc1