Reaction Details
TargetNitric oxide synthase, inducible
LigandBDBM50225106
Substrate/Competitorn/a
Meas. Tech.ChEBML_89344
IC50 10000±n/a nM
Citation Cowart, MKowaluk, EAKohlhaas, KLAlexander, KMKerwin, JF Synthesis of phosphorus-containing amino acid analogs as inhibitors of nitric oxide synthase Bioorg Med Chem Lett6:999-1002 (1996)    Article
 
Nitric oxide synthase, inducible
Name:Nitric oxide synthase, inducible
Type:Enzyme
Mol. Mass.:130595.79
Organism:Mus musculus (mouse)
Description:Recombinant enzyme overexpressed in E. coli.
Residue:1144
BDBM50225106
NameBDBM50225106
Synonyms:(2S)-2-amino-5-{[(E)-amino(nitroimino)methyl]amino}pentanoic acid (2S)-2-amino-5-{[(E)-imino(nitroamino)methyl]amino}pentanoic acid (S)-2-Amino-5-(N'-nitro-guanidino)-pentanoic acid CHEMBL227744 N-nitro-L-arginine Ngamma-nitro-L-arginine | Nomega-nitro-L-arginine
TypeSmall organic molecule
Emp. Form.C6H13N5O4
Mol. Mass.219.1985
SMILESN[C@@H](CCCNC(N)=N[N+]([O-])=O)C(O)=O