Reaction Details
TargetMHC class II antigen
LigandBDBM50289276
Substrate/Competitorn/a
Meas. Tech.ChEBML_192856
IC50 82±n/a nM
Citation Cunningham, BRRivetna, MTolman, RLFlattery, SJNichols, EASchwartz, CDWicker, LSHermes, JDJones, AB SAR for MHC class II binding tetrapeptides: Correlation with potential binding site Bioorg Med Chem Lett7:19-24 (1997)    Article
 
MHC class II antigen
Name:MHC class II antigen
Type:PROTEIN
Mol. Mass.:29917.79
Organism:Homo sapiens (Human)
Description:ChEMBL_192854
Residue:266
BDBM50289276
NameBDBM50289276
Synonyms:(1-{2-Methyl-1-[1-(2-oxo-azepan-3-ylcarbamoyl)-ethylcarbamoyl]-propylcarbamoyl}-2-phenyl-ethyl)-carbamic acid ethyl ester | CHEMBL311245
TypeSmall organic molecule
Emp. Form.C26H39N5O6
Mol. Mass.517.6178
SMILESCCOC(=O)N[C@@H](Cc1ccccc1)C(=O)N[C@@H](C(C)C)C(=O)N[C@@H](C)C(=O)N[C@H]1CCCCNC1=O