Reaction Details
TargetMHC class II antigen
LigandBDBM50289278
Substrate/Competitorn/a
Meas. Tech.ChEBML_192856
IC50 63±n/a nM
Citation Cunningham, BRRivetna, MTolman, RLFlattery, SJNichols, EASchwartz, CDWicker, LSHermes, JDJones, AB SAR for MHC class II binding tetrapeptides: Correlation with potential binding site Bioorg Med Chem Lett7:19-24 (1997)    Article
 
MHC class II antigen
Name:MHC class II antigen
Type:PROTEIN
Mol. Mass.:29917.79
Organism:Homo sapiens (Human)
Description:ChEMBL_192854
Residue:266
BDBM50289278
NameBDBM50289278
Synonyms:(S)-2-[(S)-3-Carbamoyl-2-((S)-2-{[(R)-2-ethoxycarbonylamino-3-(4-hydroxy-phenyl)-propionyl]-methyl-amino}-5-guanidino-pentanoylamino)-propionylamino]-3-methyl-butyric acid | CHEMBL75687
TypeSmall organic molecule
Emp. Form.C28H44N8O9
Mol. Mass.636.6972
SMILESCCOC(=O)N[C@H](Cc1ccc(O)cc1)C(=O)N(C)[C@@H](CCCNC(N)=N)C(=O)N[C@@H](CC(N)=O)C(=O)N[C@@H](C(C)C)C(O)=O