Reaction Details
TargetMHC class II antigen
LigandBDBM50289255
Substrate/Competitorn/a
Meas. Tech.ChEMBL_192854 (CHEMBL800187)
IC50 160±n/a nM
Citation Cunningham, BRRivetna, MTolman, RLFlattery, SJNichols, EASchwartz, CDWicker, LSHermes, JDJones, AB SAR for MHC class II binding tetrapeptides: Correlation with potential binding site Bioorg Med Chem Lett7:19-24 (1997)    Article
 
MHC class II antigen
Name:MHC class II antigen
Type:PROTEIN
Mol. Mass.:29917.79
Organism:Homo sapiens (Human)
Description:ChEMBL_192854
Residue:266
BDBM50289255
NameBDBM50289255
Synonyms:((R)-1-{(S)-1-[(S)-1-((S)-1-Carbamoyl-3-methyl-butylcarbamoyl)-ethylcarbamoyl]-2-methyl-propylcarbamoyl}-3-phenyl-propyl)-carbamic acid ethyl ester | CHEMBL311939
TypeSmall organic molecule
Emp. Form.C27H43N5O6
Mol. Mass.533.6602
SMILESCCOC(=O)N[C@H](CCc1ccccc1)C(=O)N[C@@H](C(C)C)C(=O)N[C@@H](C)C(=O)N[C@@H](CC(C)C)C(N)=O