Reaction Details
TargetMHC class II antigen
LigandBDBM50289252
Substrate/Competitorn/a
Meas. Tech.ChEMBL_192854 (CHEMBL800187)
IC50 22±n/a nM
Citation Cunningham, BRRivetna, MTolman, RLFlattery, SJNichols, EASchwartz, CDWicker, LSHermes, JDJones, AB SAR for MHC class II binding tetrapeptides: Correlation with potential binding site Bioorg Med Chem Lett7:19-24 (1997)    Article
 
MHC class II antigen
Name:MHC class II antigen
Type:PROTEIN
Mol. Mass.:29917.79
Organism:Homo sapiens (Human)
Description:ChEMBL_192854
Residue:266
BDBM50289252
NameBDBM50289252
Synonyms:(S)-2-((S)-2-{(S)-2-[(S)-2-(3-Ethyl-ureido)-3-phenyl-propionylamino]-3-methyl-butyrylamino}-propionylamino)-4-methyl-pentanoic acid amide | CHEMBL81463
TypeSmall organic molecule
Emp. Form.C26H42N6O5
Mol. Mass.518.6489
SMILESCCNC(=O)N[C@@H](Cc1ccccc1)C(=O)N[C@@H](C(C)C)C(=O)N[C@@H](C)C(=O)N[C@@H](CC(C)C)C(N)=O