Reaction Details
TargetHistamine H1 receptor
LigandBDBM35254
Substrate/Competitorn/a
Meas. Tech.ChEBML_84431
Ki 7±n/a nM
Citation Calligaro, DOFairhurst, JHotten, TMMoore, NATupper, DE The synthesis and biological activity of some known and putative metabolites of the atypical antipsychotic agent olanzapine (LY170053) Bioorg Med Chem Lett7:25-30 (1997)    Article
 
Histamine H1 receptor
Name:Histamine H1 receptor
Type:G Protein-Coupled Receptor (GPCR)
Mol. Mass.:55808.72
Organism:Homo sapiens (Human)
Description:Cell pellets from SK-N-MC cells transfected with human H1 receptor were used in binding assay.
Residue:487
BDBM35254
NameBDBM35254
Synonyms:2-methyl-4-(4-methylpiperazin-1-yl)-10H-thieno[2,3-b][1,5]benzodiazepine Olansek Zyprexa | olanzapine
TypeSmall organic molecule
Emp. Form.C17H20N4S
Mol. Mass.312.432
SMILESCN1CCN(CC1)C1=Nc2ccccc2Nc2sc(C)cc12