Reaction Details
TargetcGMP-specific 3',5'-cyclic phosphodiesterase
LigandBDBM15296
Substrate/Competitorn/a
Meas. Tech.ChEBML_155366
IC50>10000±n/a nM
Citation Hlasta, DJBode, DCCourt, JJDesai, RCPagani, EDSilver, PJ Imidazotriazinone inhibitors of the Ca2+-calmodulin sensitive phosphodiesterase (PDE I) Bioorg Med Chem Lett7:89-94 (1997)    Article
 
cGMP-specific 3',5'-cyclic phosphodiesterase
Name:cGMP-specific 3',5'-cyclic phosphodiesterase
Type:PROTEIN
Mol. Mass.:94547.60
Organism:Rattus norvegicus
Description:ChEMBL_155367
Residue:833
BDBM15296
NameBDBM15296
Synonyms:6-methyl-2-oxo-5-(pyridin-4-yl)-1,2-dihydropyridine-3-carbonitrile CHEMBL189 Primacor US9249139, Milrinone
TypeSmall organic molecule
Emp. Form.C12H9N3O
Mol. Mass.211.2194
SMILESCc1[nH]c(=O)c(cc1-c1ccncc1)C#N