Reaction Details
TargetBeta-1 adrenergic receptor
LigandBDBM50289372
Substrate/Competitorn/a
Meas. Tech.ChEMBL_216176 (CHEMBL820268)
IC50 2150±n/a nM
Citation Iseki, KOishi, SSasai, HShibasaki, M SYNTHESIS AND BIOLOGICAL EVALUATION OF A FLUORINATED ANALOG OF THE β-ADRENERGIC BLOCKING AGENT, METOPROLOL Bioorg Med Chem Lett7:1273-1274 (1997)    Article
 
Beta-1 adrenergic receptor
Name:Beta-1 adrenergic receptor
Type:Enzyme Catalytic Domain
Mol. Mass.:50540.48
Organism:GUINEA PIG
Description:adrenergic Beta1 ADRB1 GUINEA PIG::B0FL73
Residue:467
BDBM50289372
NameBDBM50289372
Synonyms:(S)-1,1-Difluoro-3-isopropylamino-1-[4-(2-methoxy-ethyl)-phenoxy]-propan-2-ol | CHEMBL23929
TypeSmall organic molecule
Emp. Form.C15H23F2NO3
Mol. Mass.303.3448
SMILESCOCCc1ccc(OC(F)(F)[C@@H](O)CNC(C)C)cc1