Reaction Details
TargetD(4) dopamine receptor
LigandBDBM50048233
Substrate/Competitorn/a
Meas. Tech.ChEBML_61157
Ki 1.3±n/a nM
Citation Perrone, RBerardi, FColabufo, NALeopoldo, MTortorella, V 1-(2-METHOXYPHENYL)-4-ALKYLPIPERAZINES: EFFECT OF THE N-4 SUBSTITUENT ON THE AFFINITY AND SELECTIVITY FOR DOPAMINE D4 RECEPTOR Bioorg Med Chem Lett7:1327-1330 (1997)    Article
 
D(4) dopamine receptor
Name:D(4) dopamine receptor
Type:Enzyme
Mol. Mass.:48373.19
Organism:Homo sapiens (Human)
Description:P21917
Residue:419
BDBM50048233
NameBDBM50048233
Synonyms:1-(2-Methoxy-phenyl)-4-(1-phenyl-1H-pyrrol-3-ylmethyl)-piperazine | CHEMBL28321
TypeSmall organic molecule
Emp. Form.C22H25N3O
Mol. Mass.347.4534
SMILESCOc1ccccc1N1CCN(Cc2ccn(c2)-c2ccccc2)CC1