Reaction Details
TargetReverse transcriptase/RNaseH
LigandBDBM50289784
Substrate/Competitorn/a
Meas. Tech.ChEBML_195201
IC50>30000±n/a nM
Citation Artico, MSanto, RDCosti, RMassa, SScintu, FLoi, AGMontis, ADColla, PL 1-Arylsulfonyl-3-(α-hydroxybenzyl)-1H-pyrroles, a novel class of anti-HIV-1 reverse transcriptase inhibitors Bioorg Med Chem Lett7:1931-1936 (1997)    Article
 
Reverse transcriptase/RNaseH
Name:Reverse transcriptase/RNaseH
Type:PROTEIN
Mol. Mass.:65229.15
Organism:Human immunodeficiency virus 1
Description:ChEMBL_1473730
Residue:566
BDBM50289784
NameBDBM50289784
Synonyms:(1-Benzenesulfonyl-1H-pyrrol-3-yl)-(2,4-dichloro-phenyl)-methanol | CHEMBL293538
TypeSmall organic molecule
Emp. Form.C17H13Cl2NO3S
Mol. Mass.382.261
SMILESOC(c1ccn(c1)S(=O)(=O)c1ccccc1)c1ccc(Cl)cc1Cl