Reaction Details
TargetReverse transcriptase/RNaseH
LigandBDBM50289791
Substrate/Competitorn/a
Meas. Tech.ChEBML_195201
IC50 18000±n/a nM
Citation Artico, MSanto, RDCosti, RMassa, SScintu, FLoi, AGMontis, ADColla, PL 1-Arylsulfonyl-3-(α-hydroxybenzyl)-1H-pyrroles, a novel class of anti-HIV-1 reverse transcriptase inhibitors Bioorg Med Chem Lett7:1931-1936 (1997)    Article
 
Reverse transcriptase/RNaseH
Name:Reverse transcriptase/RNaseH
Type:PROTEIN
Mol. Mass.:65229.15
Organism:Human immunodeficiency virus 1
Description:ChEMBL_1473730
Residue:566
BDBM50289791
NameBDBM50289791
Synonyms:(2,4-Dichloro-phenyl)-[1-(toluene-4-sulfonyl)-1H-pyrrol-3-yl]-methanol | CHEMBL301913
TypeSmall organic molecule
Emp. Form.C18H15Cl2NO3S
Mol. Mass.396.288
SMILESCc1ccc(cc1)S(=O)(=O)n1ccc(c1)C(O)c1ccc(Cl)cc1Cl