Reaction Details
TargetCaspase-1
LigandBDBM50290014
Substrate/Competitorn/a
Meas. Tech.ChEBML_91011
Ki 9±n/a nM
Citation Golec, JMMullican, MDMurcko, MAWilson, KPKay, DPJones, SDMurdoch, RBemis, GWRaybuck, SALuong, YPLivingston, DJ Structure-based design of non-peptidic pyridone aldehydes as inhibitors of interleukin-1β converting enzyme Bioorg Med Chem Lett7:2181-2186 (1997)    Article
 
Caspase-1
Name:Caspase-1
Type:Enzyme
Mol. Mass.:45154.13
Organism:Homo sapiens (Human)
Description:P29466
Residue:404
BDBM50290014
NameBDBM50290014
Synonyms:(S)-2-((S)-2-{(S)-2-[(S)-2-Acetylamino-3-(4-hydroxy-phenyl)-propionylamino]-3-methyl-butyrylamino}-propionylamino)-succinic acid N-acetyl-L-tyrosyl-L-valyl-L-alanyl-L-aspartic aldehyde
TypeSmall organic molecule
Emp. Form.C23H32N4O9
Mol. Mass.508.5216
SMILESCC(C)[C@H](NC(=O)[C@H](Cc1ccc(O)cc1)NC(C)=O)C(=O)N[C@@H](C)C(=O)N[C@@H](CC(O)=O)C(O)=O