Reaction Details
TargetCaspase-1
LigandBDBM50290016
Substrate/Competitorn/a
Meas. Tech.ChEBML_91011
Ki 1300±n/a nM
Citation Golec, JMMullican, MDMurcko, MAWilson, KPKay, DPJones, SDMurdoch, RBemis, GWRaybuck, SALuong, YPLivingston, DJ Structure-based design of non-peptidic pyridone aldehydes as inhibitors of interleukin-1β converting enzyme Bioorg Med Chem Lett7:2181-2186 (1997)    Article
 
Caspase-1
Name:Caspase-1
Type:Enzyme
Mol. Mass.:45154.13
Organism:Homo sapiens (Human)
Description:P29466
Residue:404
BDBM50290016
NameBDBM50290016
Synonyms:(S)-2-[2-((S)-2-Benzyloxycarbonylamino-3-methyl-butyrylamino)-acetylamino]-succinic acid | CHEMBL307573
TypeSmall organic molecule
Emp. Form.C19H25N3O8
Mol. Mass.423.4171
SMILESCC(C)[C@H](NC(=O)OCc1ccccc1)C(=O)NCC(=O)N[C@@H](CC(O)=O)C(O)=O