Reaction Details
TargetSodium-dependent serotonin transporter
LigandBDBM22870
Substrate/Competitorn/a
Ki 290±n/a nM
CommentsPDSP_290
Citation Cheetham, SCViggers, JASlater, NAHeal, DJBuckett, WR [3H]paroxetine binding in rat frontal cortex strongly correlates with [3H]5-HT uptake: effect of administration of various antidepressant treatments. Neuropharmacology32:737-43 (1993) 
 
Sodium-dependent serotonin transporter
Name:Sodium-dependent serotonin transporter
Type:Multi-pass membrane protein
Mol. Mass.:70168.43
Organism:Rattus norvegicus (rat)
Description:P31652
Residue:630
BDBM22870
NameBDBM22870
Synonyms:13-chloro-10-(piperazin-1-yl)-2-oxa-9-azatricyclo[9.4.0.0^{3,8}]pentadeca-1(11),3,5,7,9,12,14-heptaene Amoxapine CHEMBL1113 | Demolox
TypeSmall organic molecule
Emp. Form.C17H16ClN3O
Mol. Mass.313.781
SMILESClc1ccc2Oc3ccccc3N=C(N3CCNCC3)c2c1