Reaction Details
TargetSodium-dependent serotonin transporter
LigandBDBM84742
Substrate/Competitorn/a
Ki 3131±n/a nM
CommentsPDSP_5207
Citation Cheetham, SCViggers, JASlater, NAHeal, DJBuckett, WR [3H]paroxetine binding in rat frontal cortex strongly correlates with [3H]5-HT uptake: effect of administration of various antidepressant treatments. Neuropharmacology32:737-43 (1993) 
 
Sodium-dependent serotonin transporter
Name:Sodium-dependent serotonin transporter
Type:Multi-pass membrane protein
Mol. Mass.:70168.43
Organism:Rattus norvegicus (rat)
Description:P31652
Residue:630
BDBM84742
NameBDBM84742
Synonyms:CAS_106650-56-0 sibutramine
TypeSmall organic molecule
Emp. Form.C17H26ClN
Mol. Mass.279.848
SMILESCC(C)CC(N(C)C)C1(CCC1)c1ccc(Cl)cc1