Reaction Details
TargetAdenosine receptor A1
LigandBDBM50176050
Substrate/Competitorn/a
Meas. Tech.ChEMBL_28992 (CHEMBL645016)
Ki 150±n/a nM
Citation Shimada, JKoike, NNonaka, HShiozaki, SYanagawa, KKanda, TKobayashi, HIchimura, MNakamura, JKase, HSuzuki, F Adenosine A2A antagonists with potent anti-cataleptic activity Bioorg Med Chem Lett7:2349-2352 (1997)    Article
 
Adenosine receptor A1
Name:Adenosine receptor A1
Type:Protein
Mol. Mass.:36704.13
Organism:Rattus norvegicus (rat)
Description:n/a
Residue:326
BDBM50176050
NameBDBM50176050
Synonyms:8-(3,4-dimethoxystyryl)-1,3-diethyl-7-methyl-1H-purine-2,6(3H,7H)-dione 8-[2-(3,4-dimethoxy-phenyl)-vinyl]-1,3-diethyl-7-methyl-3,9-dihydro-purine-2,6-dione US11806350, Compound Istradefylline | istradefylline
TypeSmall organic molecule
Emp. Form.C20H24N4O4
Mol. Mass.384.429
SMILESCCn1c2nc(\C=C\c3ccc(OC)c(OC)c3)n(C)c2c(=O)n(CC)c1=O