Reaction Details
TargetAdenosine receptor A1
LigandBDBM50006707
Substrate/Competitorn/a
Meas. Tech.ChEBML_29422
Ki>10000±n/a nM
Citation Shimada, JKoike, NNonaka, HShiozaki, SYanagawa, KKanda, TKobayashi, HIchimura, MNakamura, JKase, HSuzuki, F Adenosine A2A antagonists with potent anti-cataleptic activity Bioorg Med Chem Lett7:2349-2352 (1997)    Article
 
Adenosine receptor A1
Name:Adenosine receptor A1
Type:Enzyme Catalytic Domain
Mol. Mass.:36501.39
Organism:GUINEA PIG
Description:ADENOSINE A1 ADORA1 GUINEA PIG::P47745
Residue:326
BDBM50006707
NameBDBM50006707
Synonyms:8-[(E)-2-(4-Chloro-phenyl)-vinyl]-7-methyl-1,3-dipropyl-3,7-dihydro-purine-2,6-dione CHEMBL75093
TypeSmall organic molecule
Emp. Form.C20H23ClN4O2
Mol. Mass.386.875
SMILESCCCn1c2nc(\C=C\c3ccc(Cl)cc3)n(C)c2c(=O)n(CCC)c1=O