Reaction Details
TargetAdenosine receptor A2a
LigandBDBM50006714
Substrate/Competitorn/a
Meas. Tech.ChEMBL_30920 (CHEMBL647730)
Ki 1.7±n/a nM
Citation Shimada, JKoike, NNonaka, HShiozaki, SYanagawa, KKanda, TKobayashi, HIchimura, MNakamura, JKase, HSuzuki, F Adenosine A2A antagonists with potent anti-cataleptic activity Bioorg Med Chem Lett7:2349-2352 (1997)    Article
 
Adenosine receptor A2a
Name:Adenosine receptor A2a
Type:G Protein-Coupled Receptor (GPCR)
Mol. Mass.:45015.65
Organism:Rattus norvegicus (rat)
Description:Rat A2A receptors expressed in CHO cells.
Residue:410
BDBM50006714
NameBDBM50006714
Synonyms:7-Methyl-1,3-dipropyl-8-[(E)-2-(3,4,5-trimethoxy-phenyl)-vinyl]-3,7-dihydro-purine-2,6-dione CHEMBL306313
TypeSmall organic molecule
Emp. Form.C23H30N4O5
Mol. Mass.442.5081
SMILESCCCn1c2nc(\C=C\c3cc(OC)c(OC)c(OC)c3)n(C)c2c(=O)n(CCC)c1=O