Reaction Details
TargetAdenosine receptor A2a
LigandBDBM50006702
Substrate/Competitorn/a
Meas. Tech.ChEBML_30920
Ki 15±n/a nM
Citation Shimada, JKoike, NNonaka, HShiozaki, SYanagawa, KKanda, TKobayashi, HIchimura, MNakamura, JKase, HSuzuki, F Adenosine A2A antagonists with potent anti-cataleptic activity Bioorg Med Chem Lett7:2349-2352 (1997)    Article
 
Adenosine receptor A2a
Name:Adenosine receptor A2a
Type:G Protein-Coupled Receptor (GPCR)
Mol. Mass.:45015.65
Organism:Rattus norvegicus (rat)
Description:Rat A2A receptors expressed in CHO cells.
Residue:410
BDBM50006702
NameBDBM50006702
Synonyms:7-Methyl-1,3-dipropyl-8-((E)-styryl)-3,7-dihydro-purine-2,6-dione CHEMBL312079
TypeSmall organic molecule
Emp. Form.C20H24N4O2
Mol. Mass.352.4302
SMILESCCCn1c2nc(\C=C\c3ccccc3)n(C)c2c(=O)n(CCC)c1=O