Reaction Details
TargetAdenosine receptor A1
LigandBDBM50290167
Substrate/Competitorn/a
Meas. Tech.ChEMBL_28992 (CHEMBL645016)
Ki 120±n/a nM
Citation Shimada, JKoike, NNonaka, HShiozaki, SYanagawa, KKanda, TKobayashi, HIchimura, MNakamura, JKase, HSuzuki, F Adenosine A2A antagonists with potent anti-cataleptic activity Bioorg Med Chem Lett7:2349-2352 (1997)    Article
 
Adenosine receptor A1
Name:Adenosine receptor A1
Type:Protein
Mol. Mass.:36704.13
Organism:Rattus norvegicus (rat)
Description:n/a
Residue:326
BDBM50290167
NameBDBM50290167
Synonyms:1,3-Diethyl-8-[(E)-2-(4-methoxy-2,3-dimethyl-phenyl)-vinyl]-7-methyl-3,7-dihydro-purine-2,6-dione | CHEMBL77698
TypeSmall organic molecule
Emp. Form.C21H26N4O3
Mol. Mass.382.4561
SMILESCCn1c2nc(\C=C\c3ccc(OC)c(C)c3C)n(C)c2c(=O)n(CC)c1=O