Reaction Details
TargetGag-Pol polyprotein [489-587]
LigandBDBM50290523
Substrate/Competitorn/a
Meas. Tech.ChEBML_79974
Ki 3.1±n/a nM
Citation Choy, NChoi, HiJung, WHKim, CRYoon, HKim, SCLee, TGKoh, JS Synthesis of irreversible HIV-1 protease inhibitors containing sulfonamide and sulfone as amide bond isosteres Bioorg Med Chem Lett7:2635-2638 (1997)    Article
 
Gag-Pol polyprotein [489-587]
Name:Gag-Pol polyprotein [489-587]
Type:Enzyme Subunit
Mol. Mass.:10781.16
Organism:Human immunodeficiency virus type 1
Description:P04585[489-587]
Residue:99
BDBM50290523
NameBDBM50290523
Synonyms:CHEMBL327222 | Thiophene-2-carboxylic acid [(R)-1-((S)-1-{(2R,3S)-3-[2-(ethyl-isopropyl-sulfamoyl)-ethyl]-oxiranyl}-2-phenyl-ethylcarbamoyl)-2-methanesulfonyl-2-methyl-propyl]-amide
TypeSmall organic molecule
Emp. Form.C28H41N3O7S3
Mol. Mass.627.836
SMILESCCN(C(C)C)S(=O)(=O)CC[C@@H]1O[C@@H]1[C@H](Cc1ccccc1)NC(=O)[C@@H](NC(=O)c1cccs1)C(C)(C)S(C)(=O)=O