Reaction Details
TargetCannabinoid receptor 1
LigandBDBM50060617
Substrate/Competitorn/a
Meas. Tech.ChEMBL_46292 (CHEMBL661061)
Ki 5.7±n/a nM
Citation Ryan, WJBanner, WKCrocker, PJMartin, BRRazdan, RK Synthesis of (+)- and (−)-2-methylarachidonyl-2′-fluoroethylamide (O-689) Bioorg Med Chem Lett7:2669-2672 (1997)    Article
 
Cannabinoid receptor 1
Name:Cannabinoid receptor 1
Type:G Protein-Coupled Receptor (GPCR)
Mol. Mass.:52856.55
Organism:Rattus norvegicus (rat)
Description:P20272
Residue:473
BDBM50060617
NameBDBM50060617
Synonyms:(5Z,8Z,11Z,14Z)-2-Methyl-icosa-5,8,11,14-tetraenoic acid (2-fluoro-ethyl)-amide CHEMBL309042
TypeSmall organic molecule
Emp. Form.C23H38FNO
Mol. Mass.363.5523
SMILESCCCCC\C=C/C\C=C/C\C=C/C\C=C/CCC(C)C(=O)NCCF