Reaction Details
TargetAcetylcholine receptor subunit alpha
LigandBDBM50035398
Substrate/Competitorn/a
Meas. Tech.ChEBML_223071
EC50 411000±n/a nM
Citation Elliott, RLRyther, KBAnderson, DJPiattoni-Kaplan, MKuntzweiler, TADonnelly-Roberts, DArneric, SPHolladay, MW Novel 2-(2′-furo[3,2-b]pyridinyl) pyrrolidines: potent neuronal nicotinic acetylcholine receptor ligands Bioorg Med Chem Lett7:2703-2708 (1997)    Article
 
Acetylcholine receptor subunit alpha
Name:Acetylcholine receptor subunit alpha
Type:Ion channel
Mol. Mass.:54542.01
Organism:Homo sapiens (Human)
Description:n/a
Residue:482
BDBM50035398
NameBDBM50035398
Synonyms:(S)-1-Methyl-2-(3-methyl-isoxazol-5-yl)-pyrrolidinium 3-Methyl-5-((S)-1-methyl-pyrrolidin-2-yl)-isoxazole CHEMBL274525
TypeSmall organic molecule
Emp. Form.C9H14N2O
Mol. Mass.166.2203
SMILESCN1CCC[C@H]1c1cc(C)no1