Reaction Details
TargetAcetylcholine receptor subunit alpha
LigandBDBM50049756
Substrate/Competitorn/a
Meas. Tech.ChEBML_223071
EC50 34000±n/a nM
Citation Elliott, RLRyther, KBAnderson, DJPiattoni-Kaplan, MKuntzweiler, TADonnelly-Roberts, DArneric, SPHolladay, MW Novel 2-(2′-furo[3,2-b]pyridinyl) pyrrolidines: potent neuronal nicotinic acetylcholine receptor ligands Bioorg Med Chem Lett7:2703-2708 (1997)    Article
 
Acetylcholine receptor subunit alpha
Name:Acetylcholine receptor subunit alpha
Type:Ion channel
Mol. Mass.:54542.01
Organism:Homo sapiens (Human)
Description:n/a
Residue:482
BDBM50049756
NameBDBM50049756
Synonyms:3-((S)-1-Methyl-pyrrolidin-2-ylmethoxy)-pyridine CHEMBL84149
TypeSmall organic molecule
Emp. Form.C11H16N2O
Mol. Mass.192.2575
SMILESCN1CCC[C@H]1COc1cccnc1