Reaction Details
TargetNeutrophil collagenase
LigandBDBM50290674
Substrate/Competitorn/a
Meas. Tech.ChEBML_102109
IC50 30±n/a nM
Citation Baxter, ADBhogal, RBird, JBBuckley, GMGregory, DSHedger, PCManallack, DTMassil, TMinton, KJMontana, JGNeidle, SOwen, DAWatson, RJ Mercaptoacyl matrix metalloproteinase inhibitors: The effect of substitution at the mercaptoacyl moiety Bioorg Med Chem Lett7:2765-2770 (1997)    Article
 
Neutrophil collagenase
Name:Neutrophil collagenase
Type:Enzyme
Mol. Mass.:53413.48
Organism:Homo sapiens (Human)
Description:P22894
Residue:467
BDBM50290674
NameBDBM50290674
Synonyms:(R)-4-(2,5-Dioxo-pyrrolidin-1-yl)-2-mercapto-N-[(R)-1-((S)-1-methylcarbamoyl-2-phenyl-ethylcarbamoyl)-2-methylsulfanyl-ethyl]-butyramide | CHEMBL92970
TypeSmall organic molecule
Emp. Form.C22H30N4O5S2
Mol. Mass.494.627
SMILESCNC(=O)[C@H](Cc1ccccc1)NC(=O)[C@H](CSC)NC(=O)[C@H](S)CCN1C(=O)CCC1=O