Reaction Details
Target5-hydroxytryptamine receptor 1D
LigandBDBM50033447
Substrate/Competitorn/a
Meas. Tech.ChEBML_1732
Ki 2±n/a nM
Citation Jorand-Lebrun, CPauwels, PJPalmier, CChopin, PMoret, CMarien, MHalazy, S Arylpiperazide derivatives of phenylpiperazines as a new class of potent and selective 5-HT1B receptor antagonists Bioorg Med Chem Lett7:3183-3188 (1997)    Article
 
5-hydroxytryptamine receptor 1D
Name:5-hydroxytryptamine receptor 1D
Type:G Protein-Coupled Receptor (GPCR)
Mol. Mass.:41920.63
Organism:Homo sapiens (Human)
Description:Receptor binding assays were performed using human clone stably expressed in CHO cells.
Residue:377
BDBM50033447
NameBDBM50033447
Synonyms:2-[3-(2-Amino-ethyl)-1H-indol-5-yloxy]-1-(4-o-tolyl-piperazin-1-yl)-ethanone CHEMBL321818
TypeSmall organic molecule
Emp. Form.C23H28N4O2
Mol. Mass.392.494
SMILESCc1ccccc1N1CCN(CC1)C(=O)COc1ccc2[nH]cc(CCN)c2c1