Reaction Details
TargetLanosterol synthase
LigandBDBM50290991
Substrate/Competitorn/a
Meas. Tech.ChEBML_148880
Ki 4500±n/a nM
Citation Madden, BAPrestwich, GD Potency and inactivation rates of analogues of an irreversible inhibitor of vertebrate oxidosqualene cyclase Bioorg Med Chem Lett7:309-314 (1997)    Article
 
Lanosterol synthase
Name:Lanosterol synthase
Type:PROTEIN
Mol. Mass.:83302.12
Organism:Rattus norvegicus
Description:ChEMBL_12083
Residue:733
BDBM50290991
NameBDBM50290991
Synonyms:2,2-Dimethyl-3-(3,7,12,20-tetramethyl-16-vinyl-henicosa-3,7,11,15-tetraenyl)-oxirane | CHEMBL105768
TypeSmall organic molecule
Emp. Form.C31H52O
Mol. Mass.440.744
SMILESCC(C)CCC\C(C=C)=C\CC\C(C)=C\CC\C=C(/C)CC\C=C(/C)CC[C@@H]1OC1(C)C