Reaction Details
TargetLanosterol synthase
LigandBDBM50290992
Substrate/Competitorn/a
Meas. Tech.ChEMBL_148883 (CHEMBL753758)
Ki 10200±n/a nM
Citation Madden, BAPrestwich, GD Potency and inactivation rates of analogues of an irreversible inhibitor of vertebrate oxidosqualene cyclase Bioorg Med Chem Lett7:309-314 (1997)    Article
 
Lanosterol synthase
Name:Lanosterol synthase
Type:PROTEIN
Mol. Mass.:83302.12
Organism:Rattus norvegicus
Description:ChEMBL_12083
Residue:733
BDBM50290992
NameBDBM50290992
Synonyms:3-[16-(2,2-Difluoro-vinyl)-3,7,12,20-tetramethyl-henicosa-3,7,11,15,19-pentaenyl]-2,2-dimethyl-oxirane | CHEMBL418814
TypeSmall organic molecule
Emp. Form.C31H48F2O
Mol. Mass.474.709
SMILES[#6]\[#6](-[#6])=[#6]/[#6]-[#6]\[#6](=[#6]\[#6]-[#6]\[#6](-[#6])=[#6]\[#6]-[#6]\[#6]=[#6](/[#6])-[#6]-[#6]\[#6]=[#6](/[#6])-[#6]-[#6]-[#6@@H]1-[#8]C1([#6])[#6])\[#6]=[#6](/F)F