Reaction Details
TargetLanosterol synthase
LigandBDBM50290989
Substrate/Competitorn/a
Meas. Tech.ChEBML_148880
Ki 12000±n/a nM
Citation Madden, BAPrestwich, GD Potency and inactivation rates of analogues of an irreversible inhibitor of vertebrate oxidosqualene cyclase Bioorg Med Chem Lett7:309-314 (1997)    Article
 
Lanosterol synthase
Name:Lanosterol synthase
Type:PROTEIN
Mol. Mass.:83302.12
Organism:Rattus norvegicus
Description:ChEMBL_12083
Residue:733
BDBM50290989
NameBDBM50290989
Synonyms:3-[16-(2,2-Difluoro-vinyl)-3,7,12,20-tetramethyl-henicosa-3,7,11,15-tetraenyl]-2,2-dimethyl-oxirane | CHEMBL106537
TypeSmall organic molecule
Emp. Form.C31H50F2O
Mol. Mass.476.7249
SMILES[#6]-[#6](-[#6])-[#6]-[#6]-[#6]\[#6](=[#6]\[#6]-[#6]\[#6](-[#6])=[#6]\[#6]-[#6]\[#6]=[#6](/[#6])-[#6]-[#6]\[#6]=[#6](/[#6])-[#6]-[#6]-[#6@@H]1-[#8]C1([#6])[#6])\[#6]=[#6](/F)F