Reaction Details
TargetSodium-dependent serotonin transporter
LigandBDBM50010195
Substrate/Competitorn/a
Meas. Tech.ChEBML_201995
Ki 0.440000±n/a nM
Citation Tamagnan, GNeumeyer, JLGao, YWang, SKula, NSBaldessarini, RJ N-Phthalimidoalkyl derivatives of 2β-carbomethoxy-3β-(4′-iodophenyl)tropane (β-CIT): Brain monoamine transporter affinity Bioorg Med Chem Lett7:337-340 (1997)    Article
 
Sodium-dependent serotonin transporter
Name:Sodium-dependent serotonin transporter
Type:Multi-pass membrane protein
Mol. Mass.:70168.43
Organism:Rattus norvegicus (rat)
Description:P31652
Residue:630
BDBM50010195
NameBDBM50010195
Synonyms:(3S,5R)-methyl 3-(4-iodophenyl)-8-methyl-8-aza-bicyclo[3.2.1]octane-2-carboxylate 3-(4-Iodo-phenyl)-8-methyl-8-aza-bicyclo[3.2.1]octane-2-carboxylic acid methyl ester | CHEMBL14391
TypeSmall organic molecule
Emp. Form.C16H20INO2
Mol. Mass.385.24
SMILESCOC(=O)C1C2CCC(CC1c1ccc(I)cc1)N2C