Reaction Details
TargetMaltase-glucoamylase
LigandBDBM50291023
Substrate/Competitorn/a
Meas. Tech.ChEBML_70932
Ki 87±n/a nM
Citation Lesur, BDucep, JBLalloz, MNEhrhard, ADanzin, C New deoxynojirimycin derivatives as potent inhibitors of intestinal α-glucohydrolases Bioorg Med Chem Lett7:355-360 (1997)    Article
 
Maltase-glucoamylase
Name:Maltase-glucoamylase
Type:Enzyme
Mol. Mass.:209817.06
Organism:Homo sapiens (Human)
Description:O43451
Residue:2753
BDBM50291023
NameBDBM50291023
Synonyms:(2R,3R,4R,5S)-1-[(E)-3-(tert-Butyl-dimethyl-silanyl)-allyl]-2-hydroxymethyl-piperidine-3,4,5-triol | CHEMBL120395
TypeSmall organic molecule
Emp. Form.C15H31NO4Si
Mol. Mass.317.4964
SMILESCC(C)(C)[Si](C)(C)\C=C\CN1C[C@H](O)[C@@H](O)[C@H](O)[C@H]1CO