Reaction Details
TargetMaltase-glucoamylase
LigandBDBM50291033
Substrate/Competitorn/a
Meas. Tech.ChEBML_70932
Ki 2600±n/a nM
Citation Lesur, BDucep, JBLalloz, MNEhrhard, ADanzin, C New deoxynojirimycin derivatives as potent inhibitors of intestinal α-glucohydrolases Bioorg Med Chem Lett7:355-360 (1997)    Article
 
Maltase-glucoamylase
Name:Maltase-glucoamylase
Type:Enzyme
Mol. Mass.:209817.06
Organism:Homo sapiens (Human)
Description:O43451
Residue:2753
BDBM50291033
NameBDBM50291033
Synonyms:(2R,3R,4R,5S)-1-[(Dimethyl-phenyl-silanyl)-methyl]-2-hydroxymethyl-piperidine-3,4,5-triol | CHEMBL333917
TypeSmall organic molecule
Emp. Form.C15H25NO4Si
Mol. Mass.311.4488
SMILESC[Si](C)(CN1C[C@H](O)[C@@H](O)[C@H](O)[C@H]1CO)c1ccccc1