Reaction Details
TargetMaltase-glucoamylase
LigandBDBM50291027
Substrate/Competitorn/a
Meas. Tech.ChEBML_70932
Ki 28±n/a nM
Citation Lesur, BDucep, JBLalloz, MNEhrhard, ADanzin, C New deoxynojirimycin derivatives as potent inhibitors of intestinal α-glucohydrolases Bioorg Med Chem Lett7:355-360 (1997)    Article
 
Maltase-glucoamylase
Name:Maltase-glucoamylase
Type:Enzyme
Mol. Mass.:209817.06
Organism:Homo sapiens (Human)
Description:O43451
Residue:2753
BDBM50291027
NameBDBM50291027
Synonyms:(2R,3R,4R,5S)-2-Hydroxymethyl-1-(4-trimethylsilanyl-benzyl)-piperidine-3,4,5-triol | CHEMBL332802
TypeSmall organic molecule
Emp. Form.C16H27NO4Si
Mol. Mass.325.4754
SMILESC[Si](C)(C)c1ccc(CN2C[C@H](O)[C@@H](O)[C@H](O)[C@H]2CO)cc1