Reaction Details
TargetGag-Pol polyprotein [489-587]
LigandBDBM50291059
Substrate/Competitorn/a
Meas. Tech.ChEBML_157558
Ki 19±n/a nM
Citation Schwartz, TMBundy, GLStrohbach, JWThaisrivongs, SJohnson, PDSkulnick, HITomich, PKLynn, JCChong, KTHinshaw, RRRaub, TJPadbury, GEToth, LN Synthesis and pharmacological evaluation of sulfone substituted HIV protease inhibitors Bioorg Med Chem Lett7:399-402 (1997)    Article
 
Gag-Pol polyprotein [489-587]
Name:Gag-Pol polyprotein [489-587]
Type:Enzyme Subunit
Mol. Mass.:10781.16
Organism:Human immunodeficiency virus type 1
Description:P04585[489-587]
Residue:99
BDBM50291059
NameBDBM50291059
Synonyms:6-(2-Cyclopropyl-1-cyclopropylmethyl-ethyl)-3-{cyclopropyl-[3-(4-fluoro-benzenesulfonylmethyl)-phenyl]-methyl}-4-hydroxy-pyran-2-one | CHEMBL131821
TypeSmall organic molecule
Emp. Form.C31H33FO5S
Mol. Mass.536.654
SMILESOc1cc(oc(=O)c1C(C1CC1)c1cccc(CS(=O)(=O)c2ccc(F)cc2)c1)C(CC1CC1)CC1CC1