Reaction Details
TargetGag-Pol polyprotein [489-587]
LigandBDBM50291067
Substrate/Competitorn/a
Meas. Tech.ChEBML_157558
Ki 7±n/a nM
Citation Schwartz, TMBundy, GLStrohbach, JWThaisrivongs, SJohnson, PDSkulnick, HITomich, PKLynn, JCChong, KTHinshaw, RRRaub, TJPadbury, GEToth, LN Synthesis and pharmacological evaluation of sulfone substituted HIV protease inhibitors Bioorg Med Chem Lett7:399-402 (1997)    Article
 
Gag-Pol polyprotein [489-587]
Name:Gag-Pol polyprotein [489-587]
Type:Enzyme Subunit
Mol. Mass.:10781.16
Organism:Human immunodeficiency virus type 1
Description:P04585[489-587]
Residue:99
BDBM50291067
NameBDBM50291067
Synonyms:4-{3-[Cyclopropyl-(4-hydroxy-2-oxo-5,6,7,8,9,10-hexahydro-2H-cycloocta[b]pyran-3-yl)-methyl]-phenylmethanesulfonyl}-benzoic acid | CHEMBL131317
TypeSmall organic molecule
Emp. Form.C29H30O7S
Mol. Mass.522.609
SMILESOC(=O)c1ccc(cc1)S(=O)(=O)Cc1cccc(c1)C(C1CC1)c1c(O)c2CCCCCCc2oc1=O