Reaction Details
TargetEpidermal growth factor receptor
LigandBDBM50291105
Substrate/Competitorn/a
Meas. Tech.ChEBML_63790
IC50>20000±n/a nM
Citation Myers, MRSetzer, NNSpada, APPersons, PELy, CQMaguire, MPZulli, ALCheney, DLZilberstein, AJohnson, SEFranks, CFMitchell, KJ The synthesis and SAR of new 4-(N-alkyl-N-phenyl)amino-6,7-dimethoxyquinazolines and 4-(N-alkyl-N-phenyl)aminopyrazolo[3,4-Bioorg Med Chem Lett7:421-424 (1997)    Article
 
Epidermal growth factor receptor
Name:Epidermal growth factor receptor
Type:Receptor Kinase Domain
Mol. Mass.:134279.59
Organism:Homo sapiens (Human)
Description:P00533
Residue:1210
BDBM50291105
NameBDBM50291105
Synonyms:(6,8-Dimethyl-quinazolin-4-yl)-methyl-phenyl-amine | CHEMBL133147
TypeSmall organic molecule
Emp. Form.C17H17N3
Mol. Mass.263.337
SMILESCN(c1ccccc1)c1ncnc2c(C)cc(C)cc12