Reaction Details
TargetEpidermal growth factor receptor
LigandBDBM50291109
Substrate/Competitorn/a
Meas. Tech.ChEBML_63790
IC50 6500±n/a nM
Citation Myers, MRSetzer, NNSpada, APPersons, PELy, CQMaguire, MPZulli, ALCheney, DLZilberstein, AJohnson, SEFranks, CFMitchell, KJ The synthesis and SAR of new 4-(N-alkyl-N-phenyl)amino-6,7-dimethoxyquinazolines and 4-(N-alkyl-N-phenyl)aminopyrazolo[3,4-Bioorg Med Chem Lett7:421-424 (1997)    Article
 
Epidermal growth factor receptor
Name:Epidermal growth factor receptor
Type:Receptor Kinase Domain
Mol. Mass.:134279.59
Organism:Homo sapiens (Human)
Description:P00533
Residue:1210
BDBM50291109
NameBDBM50291109
Synonyms:(6,7-Dimethyl-quinazolin-4-yl)-methyl-m-tolyl-amine; hydrochloride | CHEMBL554566
TypeSmall organic molecule
Emp. Form.C18H19N3
Mol. Mass.277.3636
SMILESCN(c1cccc(C)c1)c1ncnc2cc(C)c(C)cc12